Target
Sterol O-acyltransferase 1
Ligand
BDBM50037632
Substrate
Meas. Tech.
ChEBML_28486
IC50
490±n/a nM
Citation
 Wilde, RJBillheimer, JTGermain, SJGillies, PJHigley, CAKezar, HSMaduskuie, TPShimshick, ESWexler, RR Acyl CoA:cholesterol acyltransferase (ACAT) inhibitors: ureas bearing heterocyclic groups bioisosteric for an imidazole Bioorg Med Chem Lett 5:167-72 (1995)   
Target
Name:
Sterol O-acyltransferase 1
Synonyms:
ACAT-1 Acat SOAT1_RAT Sterol O-acyltransferase, Soat
Type:
PROTEIN
Mol. Mass.:
64165.56
Organism:
Rattus norvegicus
Description:
ChEMBL_28796
Residue:
545
  
Inhibitor
Name:
BDBM50037632
Synonyms:
3-(2,4-Difluoro-phenyl)-1-heptyl-1-[5-(4-phenyl-1H-imidazol-2-ylsulfanyl)-pentyl]-urea | CHEMBL48034
Type:
Small organic molecule
Emp. Form.:
C28H36F2N4OS
Mol. Mass.:
514.673
SMILES:
CCCCCCCN(CCCCCSc1nc(c[nH]1)-c1ccccc1)C(=O)Nc1ccc(F)cc1F
: