Target
Sterol O-acyltransferase 1
Ligand
BDBM50037630
Substrate
Meas. Tech.
ChEBML_28027
IC50
5500±n/a nM
Citation
 Wilde, RJBillheimer, JTGermain, SJGillies, PJHigley, CAKezar, HSMaduskuie, TPShimshick, ESWexler, RR Acyl CoA:cholesterol acyltransferase (ACAT) inhibitors: ureas bearing heterocyclic groups bioisosteric for an imidazole Bioorg Med Chem Lett 5:167-72 (1995)   
Target
Name:
Sterol O-acyltransferase 1
Synonyms:
ACAT-1 Acetoacetyl-CoA thiolase Acyl coenzyme A:cholesterol acyltransferase 1 Cholesterol acyltransferase 1 Soat1 | Sterol O-acyltransferase 1
Type:
PROTEIN
Mol. Mass.:
63818.83
Organism:
Mus musculus
Description:
ChEMBL_90523
Residue:
540
  
Inhibitor
Name:
BDBM50037630
Synonyms:
3-(2,4-Difluoro-phenyl)-1-heptyl-1-[5-(1H-imidazol-2-ylsulfanyl)-pentyl]-urea | CHEMBL43712
Type:
Small organic molecule
Emp. Form.:
C22H32F2N4OS
Mol. Mass.:
438.577
SMILES:
CCCCCCCN(CCCCCSc1ncc[nH]1)C(=O)Nc1ccc(F)cc1F
: