Target
Platelet-activating factor receptor
Ligand
BDBM50286027
Substrate
Meas. Tech.
ChEBML_155151
Ki
0.370000±n/a nM
Citation
 Sheppard, GSDavidsen, SKCarrera, GMPireh, DHolms, JHHeyman, HRSteinman, DHCurtin, MLConway, RGRhein, DAAlbert, DHTapang, PMagoc, TJSummers, JB Synthesis and evaluation of water soluble indole pyrrolothiazole paf antagonists Bioorg Med Chem Lett 5:2913-2918 (1995)    Article 
Target
Name:
Platelet-activating factor receptor
Synonyms:
PAF-R PTAFR_CAVPO Platelet-activating factor receptor
Type:
Protein
Mol. Mass.:
39005.63
Organism:
Cavia porcellus
Description:
Residue:
342
  
Inhibitor
Name:
BDBM50286027
Synonyms:
6-(4-Fluoro-phenyl)-3-[[(Z)-hydroxyimino]-((R)-3-pyridin-3-yl-1H-pyrrolo[1,2-c]thiazol-7-yl)-methyl]-indole-1-carboxylic acid dimethylamide | CHEMBL95440
Type:
Small organic molecule
Emp. Form.:
C29H24FN5O2S
Mol. Mass.:
525.597
SMILES:
CN(C)C(=O)n1cc(C(N=O)c2ccn3[C@H](SCc23)c2cccnc2)c2ccc(cc12)-c1ccc(F)cc1
: