Target
Prostaglandin G/H synthase 2
Ligand
BDBM50286051
Substrate
Meas. Tech.
ChEBML_159911
IC50
50±n/a nM
Citation
 Bertenshaw, SRTalley, JJRogier, DJGraneto, MJRogers, RSKramer, SWPenning, TDKoboldt, CMVeenhuizen, AWZhang, YPerkins, WE 3,4-diarylthiophenes are selective COX-2 inhibitors Bioorg Med Chem Lett 5:2919-2922 (1995)    Article 
Target
Name:
Prostaglandin G/H synthase 2
Synonyms:
COX2 Cyclooxygenase 2 (COX-2) Cyclooxygenase-2 (COX-2 AA) Cyclooxygenase-2 (COX-2) PGH2_HUMAN PHS II Prostaglandin E synthase/G/H synthase 2 Prostaglandin-endoperoxide synthase 2
Type:
Enzyme
Mol. Mass.:
69003.89
Organism:
Homo sapiens (Human)
Description:
Recombinant Cox-2 provided by Cayman (Cayman Chemical Co.,Ann Arbor, MI).
Residue:
604
  
Inhibitor
Name:
BDBM50286051
Synonyms:
3-(4-Methanesulfonyl-phenyl)-4-(4-methoxy-phenyl)-thiophene | CHEMBL98903
Type:
Small organic molecule
Emp. Form.:
C18H16O3S2
Mol. Mass.:
344.448
SMILES:
COc1ccc(cc1)-c1cscc1-c1ccc(cc1)S(C)(=O)=O
: