Target
Neutrophil collagenase
Ligand
BDBM50286353
Substrate
Meas. Tech.
ChEBML_105200
Ki
4200±n/a nM
Citation
 Wahl, RCPulvino, TAMathiowetz, AMGhose, AKJohnson, JSDelecki, DCook, ERGainor, JAGowravaram, MRTomczuk, BE Hydroxamate inhibitors of human gelatinase B (92 kDa) Bioorg Med Chem Lett 5:349-352 (1995)    Article 
Target
Name:
Neutrophil collagenase
Synonyms:
CLG1 MMP8 Matrix metalloproteinase-8 PMNL collagenase | PMNL-CL
Type:
Enzyme
Mol. Mass.:
53413.48
Organism:
Homo sapiens (Human)
Description:
P22894
Residue:
467
  
Inhibitor
Name:
BDBM50286353
Synonyms:
(R)-N*4*-Hydroxy-N*1*-[(S)-2-(1H-indol-3-yl)-1-methylcarbamoyl-ethyl]-2-methyl-succinamide | CHEMBL332891
Type:
Small organic molecule
Emp. Form.:
C17H22N4O4
Mol. Mass.:
346.381
SMILES:
CNC(=O)[C@H](Cc1c[nH]c2ccccc12)NC(=O)[C@H](C)CC(=O)NO
: