Target
Retinoic acid receptor beta
Ligand
BDBM50286562
Substrate
Meas. Tech.
ChEMBL_195648 (CHEMBL795966)
EC50
355±n/a nM
Citation
 Chandraratna, RAGillett, SJSong, TKAttard, JVuligonda, SGarst, MEArefieg, TGil, DWWheeler, L Synthesis and pharmacological activity of conformationally restricted, acetylenic retinoid analogs Bioorg Med Chem Lett 5:523-527 (1995)    Article 
Target
Name:
Retinoic acid receptor beta
Synonyms:
HAP NR1B2 RAR-beta RARB Retinoic acid receptor RXR-alpha/Retinoic acid receptor beta Retinoid receptor
Type:
PROTEIN
Mol. Mass.:
50498.70
Organism:
Homo sapiens (Human)
Description:
ChEMBL_1458015
Residue:
455
  
Inhibitor
Name:
BDBM50286562
Synonyms:
6-(2,6,6-Trimethyl-cyclohex-1-enylethynyl)-naphthalene-2-carboxylic acid | CHEMBL151672
Type:
Small organic molecule
Emp. Form.:
C22H22O2
Mol. Mass.:
318.4089
SMILES:
CC1=C(C#Cc2ccc3cc(ccc3c2)C(O)=O)C(C)(C)CCC1
: