Target
Dopamine beta-hydroxylase
Ligand
BDBM50286808
Substrate
Meas. Tech.
ChEBML_59304
Ki
160000±n/a nM
Citation
 Eydoux, FChlenov, MARéglier, M Synthesis of indane derivatives as mechanism-based inhibitors of dopamine β-hydroxylase Bioorg Med Chem Lett 5:941-944 (1995)    Article 
Target
Name:
Dopamine beta-hydroxylase
Synonyms:
DBH | DOPO_BOVIN
Type:
PROTEIN
Mol. Mass.:
68136.39
Organism:
Bos taurus
Description:
ChEMBL_50738
Residue:
610
  
Inhibitor
Name:
BDBM50286808
Synonyms:
1,1a,7,7a-Tetrahydro-3,5-dioxa-cyclopropa[a]-s-indacene | CHEMBL170175
Type:
Small organic molecule
Emp. Form.:
C11H10O2
Mol. Mass.:
174.1959
SMILES:
C1C2Cc3cc4OCOc4cc3C12
: