Target
Dopamine beta-hydroxylase
Ligand
BDBM50286814
Substrate
Meas. Tech.
ChEBML_59304
Ki
240000±n/a nM
Citation
 Eydoux, FChlenov, MARéglier, M Synthesis of indane derivatives as mechanism-based inhibitors of dopamine β-hydroxylase Bioorg Med Chem Lett 5:941-944 (1995)    Article 
Target
Name:
Dopamine beta-hydroxylase
Synonyms:
DBH | DOPO_BOVIN
Type:
PROTEIN
Mol. Mass.:
68136.39
Organism:
Bos taurus
Description:
ChEMBL_50738
Residue:
610
  
Inhibitor
Name:
BDBM50286814
Synonyms:
1-Cyclopropylmethyl-4-methoxy-benzene | CHEMBL176683
Type:
Small organic molecule
Emp. Form.:
C11H14O
Mol. Mass.:
162.2283
SMILES:
COc1ccc(CC2CC2)cc1
: