Target
Dopamine beta-hydroxylase
Ligand
BDBM50286815
Substrate
Meas. Tech.
ChEBML_59304
Ki
150000±n/a nM
Citation
 Eydoux, FChlenov, MARéglier, M Synthesis of indane derivatives as mechanism-based inhibitors of dopamine β-hydroxylase Bioorg Med Chem Lett 5:941-944 (1995)    Article 
Target
Name:
Dopamine beta-hydroxylase
Synonyms:
DBH | DOPO_BOVIN
Type:
PROTEIN
Mol. Mass.:
68136.39
Organism:
Bos taurus
Description:
ChEMBL_50738
Residue:
610
  
Inhibitor
Name:
BDBM50286815
Synonyms:
1,1a,6,6a-Tetrahydro-cyclopropa[a]inden-3-ol | CHEMBL368520
Type:
Small organic molecule
Emp. Form.:
C10H10O
Mol. Mass.:
146.1858
SMILES:
Oc1ccc2CC3CC3c2c1
: