Target
Neprilysin
Ligand
BDBM50287689
Substrate
Meas. Tech.
ChEBML_144623
Ki
0.400000±n/a nM
Citation
 Beight, DWMehdi, SKoehl, JRFlynn, GA Synthesis of constrained thiorphan analogs as inhibitors of neutral endopeptidase Bioorg Med Chem Lett 6:2053-2058 (1996)    Article 
Target
Name:
Neprilysin
Synonyms:
Mme Neprilysin Neutral endopeptidase 24.11
Type:
Protein
Mol. Mass.:
85789.59
Organism:
Rattus norvegicus (Rat)
Description:
P07861
Residue:
750
  
Inhibitor
Name:
BDBM50287689
Synonyms:
CHEMBL304233 | [(2-Mercaptomethyl-1,2,3,4-tetrahydro-naphthalene-2-carbonyl)-amino]-acetic acid benzyl ester
Type:
Small organic molecule
Emp. Form.:
C21H23NO3S
Mol. Mass.:
369.477
SMILES:
SCC1(CCc2ccccc2C1)C(=O)NCC(=O)OCc1ccccc1
: