Target
Neprilysin
Ligand
BDBM50287699
Substrate
Meas. Tech.
ChEBML_144623
Ki
0.600000±n/a nM
Citation
 Beight, DWMehdi, SKoehl, JRFlynn, GA Synthesis of constrained thiorphan analogs as inhibitors of neutral endopeptidase Bioorg Med Chem Lett 6:2053-2058 (1996)    Article 
Target
Name:
Neprilysin
Synonyms:
Mme Neprilysin Neutral endopeptidase 24.11
Type:
Protein
Mol. Mass.:
85789.59
Organism:
Rattus norvegicus (Rat)
Description:
P07861
Residue:
750
  
Inhibitor
Name:
BDBM50287699
Synonyms:
4-[(2-Mercaptomethyl-1,2,3,4-tetrahydro-naphthalene-2-carbonyl)-amino]-cyclohexanecarboxylic acid | CHEMBL62535
Type:
Small organic molecule
Emp. Form.:
C19H25NO3S
Mol. Mass.:
347.472
SMILES:
OC(=O)C1CCC(CC1)NC(=O)C1(CS)CCc2ccccc2C1
: