Target
Neprilysin
Ligand
BDBM50287700
Substrate
Meas. Tech.
ChEBML_144623
Ki
0.500000±n/a nM
Citation
 Beight, DWMehdi, SKoehl, JRFlynn, GA Synthesis of constrained thiorphan analogs as inhibitors of neutral endopeptidase Bioorg Med Chem Lett 6:2053-2058 (1996)    Article 
Target
Name:
Neprilysin
Synonyms:
Mme Neprilysin Neutral endopeptidase 24.11
Type:
Protein
Mol. Mass.:
85789.59
Organism:
Rattus norvegicus (Rat)
Description:
P07861
Residue:
750
  
Inhibitor
Name:
BDBM50287700
Synonyms:
(S)-3-(4-Hydroxy-phenyl)-2-[(2-mercaptomethyl-1,2,3,4-tetrahydro-naphthalene-2-carbonyl)-amino]-propionic acid benzyl ester | CHEMBL294760
Type:
Small organic molecule
Emp. Form.:
C28H29NO4S
Mol. Mass.:
475.599
SMILES:
Oc1ccc(C[C@H](NC(=O)C2(CS)CCc3ccccc3C2)C(=O)OCc2ccccc2)cc1
: