Target
Peroxisome proliferator-activated receptor gamma
Ligand
BDBM50085045
Substrate
Meas. Tech.
ChEBML_153639
Ki
3800±n/a nM
Citation
 Buckle, DRCantello, BCCawthorne, MACoyle, PJDean, DKFaller, AHaigh, DHindley, RMJefcott, LJLister, CAPinto, ILRami, HKSmith, DGSmith, SA Non thiazolidinedione antihyperglycaemic agents. 1: α-Heteroatom substituted β-phenylpropanoic acids Bioorg Med Chem Lett 6:2121-2126 (1996)    Article 
Target
Name:
Peroxisome proliferator-activated receptor gamma
Synonyms:
NR1C3 PPAR-gamma PPARG_HUMAN Peroxisome proliferator-activated receptor gamma (PPAR gamma) Peroxisome proliferator-activated receptor gamma (PPARĪ³) peroxisome proliferator-activated receptor gamma isoform 2
Type:
Nuclear Receptor
Mol. Mass.:
57613.46
Organism:
Homo sapiens (Human)
Description:
P37231
Residue:
505
  
Inhibitor
Name:
BDBM50085045
Synonyms:
5-((4-((6-hydroxy-2,5,7,8-tetramethyl-3,4-dihydro-2H-chromen-2-yl)methoxy)phenyl)methyl)thiazolidine-2,4-dione 5-[4-(6-Hydroxy-2,5,7,8-tetramethyl-chroman-2-ylmethoxy)-benzy l]-thiazolidine-2,4-dione (troglitazone) 5-[4-(6-Hydroxy-2,5,7,8-tetramethyl-chroman-2-ylmethoxy)-benzyl]-thiazolidine-2,4-dione(troglitazone) CHEMBL408 CS-045 PRELAY TROGLITAZONE
Type:
Small organic molecule
Emp. Form.:
C24H27NO5S
Mol. Mass.:
441.54
SMILES:
Cc1c(C)c2OC(C)(COc3ccc(Cc4sc(=O)[nH]c4O)cc3)CCc2c(C)c1O
: