Target
Cannabinoid receptor 2
Ligand
BDBM50287803
Substrate
Meas. Tech.
ChEBML_46993
Ki
8.5±n/a nM
Citation
 Gallant, MDufresne, CGareau, YGuay, DLeblanc, YPrasit, PRochette, CSawyer, NSlipetz, DMTremblay, NMetters, KMLabelle, M New class of potent ligands for the human peripheral cannabinoid receptor Bioorg Med Chem Lett 6:2263-2268 (1996)    Article 
Target
Name:
Cannabinoid receptor 2
Synonyms:
CANNABINOID CB2 CB2 CB2B CNR2_HUMAN Cannabinoid CB2 receptor Cannabinoid receptor 2 (CB2R) | hCB2
Type:
G Protein-Coupled Receptor (GPCR)
Mol. Mass.:
39690.94
Organism:
Homo sapiens (Human)
Description:
P34972
Residue:
360
  
Inhibitor
Name:
BDBM50287803
Synonyms:
(2-Methyl-3-morpholin-4-ylmethyl-indol-1-yl)-naphthalen-1-yl-methanone | CHEMBL73206
Type:
Small organic molecule
Emp. Form.:
C25H24N2O2
Mol. Mass.:
384.4703
SMILES:
Cc1c(CN2CCOCC2)c2ccccc2n1C(=O)c1cccc2ccccc12
: