Target
Prostaglandin G/H synthase 1
Ligand
BDBM50009860
Substrate
Meas. Tech.
ChEBML_158603
IC50
350±n/a nM
Citation
 Jung, KWJanda, KDand, PJWachter, M Syntheses and biological evaluation of two new naproxen analogs Bioorg Med Chem Lett 6:2281-2282 (1996)    Article 
Target
Name:
Prostaglandin G/H synthase 1
Synonyms:
COX-1 Cyclooxygenase Cyclooxygenase-1 (COX-1) PTGS1 | Prostaglandin G/H synthase (cyclooxygenase)
Type:
Enzyme
Mol. Mass.:
68692.62
Organism:
Homo sapiens (Human)
Description:
P23219
Residue:
599
  
Inhibitor
Name:
BDBM50009860
Synonyms:
2-(6-Methoxy-naphthalen-2-yl)-propionic acid 2-(6-methoxy-2-naphthyl)propanoic acid CHEMBL154 Naproxen2-(6-Methoxy-naphthalen-2-yl)-propionic acid
Type:
Small organic molecule
Emp. Form.:
C14H14O3
Mol. Mass.:
230.2592
SMILES:
COc1ccc2cc(ccc2c1)C(C)C(O)=O
: