Target
Cannabinoid receptor 2
Ligand
BDBM50287930
Substrate
Meas. Tech.
ChEBML_46992
Ki
2.6±n/a nM
Citation
 Gareau, YDufresne, CGallant, MRochette, CSawyer, NSlipetz, DMTremblay, NWeech, PKMetters, KMLabelle, M Structure activity relationships of tetrahydrocannabinol analogues on human cannabinoid receptors Bioorg Med Chem Lett 6:189-194 (1996)    Article 
Target
Name:
Cannabinoid receptor 2
Synonyms:
CANNABINOID CB2 CB2 CB2B CNR2_HUMAN Cannabinoid CB2 receptor Cannabinoid receptor 2 (CB2R) | hCB2
Type:
G Protein-Coupled Receptor (GPCR)
Mol. Mass.:
39690.94
Organism:
Homo sapiens (Human)
Description:
P34972
Residue:
360
  
Inhibitor
Name:
BDBM50287930
Synonyms:
(6aR,10aR)-3-(1,1-Dimethyl-heptyl)-1-hydroxy-6,6-dimethyl-6a,7,10,10a-tetrahydro-6H-benzo[c]chromene-9-carbaldehyde | CHEMBL59540
Type:
Small organic molecule
Emp. Form.:
C25H36O3
Mol. Mass.:
384.5515
SMILES:
CCCCCCC(C)(C)c1cc(O)c2[C@@H]3CC(C=O)=CC[C@H]3C(C)(C)Oc2c1
: