Target
Cannabinoid receptor 1
Ligand
BDBM50213163
Substrate
Meas. Tech.
ChEBML_46461
Ki
13±n/a nM
Citation
 Gareau, YDufresne, CGallant, MRochette, CSawyer, NSlipetz, DMTremblay, NWeech, PKMetters, KMLabelle, M Structure activity relationships of tetrahydrocannabinol analogues on human cannabinoid receptors Bioorg Med Chem Lett 6:189-194 (1996)    Article 
Target
Name:
Cannabinoid receptor 1
Synonyms:
CANN6 CB-R CNR CNR1_HUMAN Cannabinoid receptor Cannabinoid receptor 1 (brain)
Type:
G Protein-Coupled Receptor (GPCR)
Mol. Mass.:
52868.96
Organism:
Homo sapiens (Human)
Description:
P21554
Residue:
472
  
Inhibitor
Name:
BDBM50213163
Synonyms:
4-(1,1-dimethyl-heptyl)-3',5'-dimethyl-biphenyl-2-ol | CHEMBL56799
Type:
Small organic molecule
Emp. Form.:
C23H32O
Mol. Mass.:
324.4996
SMILES:
CCCCCCC(C)(C)c1ccc(c(O)c1)-c1cc(C)cc(C)c1
: