Target
Cannabinoid receptor 2
Ligand
BDBM50213163
Substrate
Meas. Tech.
ChEBML_46992
Ki
4.1±n/a nM
Citation
 Gareau, YDufresne, CGallant, MRochette, CSawyer, NSlipetz, DMTremblay, NWeech, PKMetters, KMLabelle, M Structure activity relationships of tetrahydrocannabinol analogues on human cannabinoid receptors Bioorg Med Chem Lett 6:189-194 (1996)    Article 
Target
Name:
Cannabinoid receptor 2
Synonyms:
CANNABINOID CB2 CB2 CB2B CNR2_HUMAN Cannabinoid CB2 receptor Cannabinoid receptor 2 (CB2R) | hCB2
Type:
G Protein-Coupled Receptor (GPCR)
Mol. Mass.:
39690.94
Organism:
Homo sapiens (Human)
Description:
P34972
Residue:
360
  
Inhibitor
Name:
BDBM50213163
Synonyms:
4-(1,1-dimethyl-heptyl)-3',5'-dimethyl-biphenyl-2-ol | CHEMBL56799
Type:
Small organic molecule
Emp. Form.:
C23H32O
Mol. Mass.:
324.4996
SMILES:
CCCCCCC(C)(C)c1ccc(c(O)c1)-c1cc(C)cc(C)c1
: