Target
Cannabinoid receptor 1
Ligand
BDBM50287934
Substrate
Meas. Tech.
ChEBML_46461
Ki
1.8±n/a nM
Citation
 Gareau, YDufresne, CGallant, MRochette, CSawyer, NSlipetz, DMTremblay, NWeech, PKMetters, KMLabelle, M Structure activity relationships of tetrahydrocannabinol analogues on human cannabinoid receptors Bioorg Med Chem Lett 6:189-194 (1996)    Article 
Target
Name:
Cannabinoid receptor 1
Synonyms:
CANN6 CB-R CNR CNR1_HUMAN Cannabinoid receptor Cannabinoid receptor 1 (brain)
Type:
G Protein-Coupled Receptor (GPCR)
Mol. Mass.:
52868.96
Organism:
Homo sapiens (Human)
Description:
P21554
Residue:
472
  
Inhibitor
Name:
BDBM50287934
Synonyms:
(6aR,10aR)-3-(1,1-Dimethyl-heptyl)-6,6-dimethyl-9-methylene-6a,7,8,9,10,10a-hexahydro-6H-benzo[c]chromen-1-ol THC, delta 9, 11
Type:
Small organic molecule
Emp. Form.:
C25H38O2
Mol. Mass.:
370.568
SMILES:
CCCCCCC(C)(C)c1cc(O)c2[C@@H]3CC(=C)CC[C@H]3C(C)(C)Oc2c1
: