Target
Cannabinoid receptor 2
Ligand
BDBM50287939
Substrate
Meas. Tech.
ChEBML_46992
Ki
20±n/a nM
Citation
 Gareau, YDufresne, CGallant, MRochette, CSawyer, NSlipetz, DMTremblay, NWeech, PKMetters, KMLabelle, M Structure activity relationships of tetrahydrocannabinol analogues on human cannabinoid receptors Bioorg Med Chem Lett 6:189-194 (1996)    Article 
Target
Name:
Cannabinoid receptor 2
Synonyms:
CANNABINOID CB2 CB2 CB2B CNR2_HUMAN Cannabinoid CB2 receptor Cannabinoid receptor 2 (CB2R) | hCB2
Type:
G Protein-Coupled Receptor (GPCR)
Mol. Mass.:
39690.94
Organism:
Homo sapiens (Human)
Description:
P34972
Residue:
360
  
Inhibitor
Name:
BDBM50287939
Synonyms:
(6aR,10aR)-3-(1,1-Dimethyl-heptyl)-1-methoxy-6,6,9-trimethyl-6a,7,10,10a-tetrahydro-6H-benzo[c]chromene | CHEMBL57367
Type:
Small organic molecule
Emp. Form.:
C26H40O2
Mol. Mass.:
384.5946
SMILES:
CCCCCCC(C)(C)c1cc(OC)c2[C@@H]3CC(C)=CC[C@H]3C(C)(C)Oc2c1
: