Target
Metabotropic glutamate receptor 6
Ligand
BDBM50288204
Substrate
Meas. Tech.
ChEMBL_218851 (CHEMBL873403)
IC50
>300000±n/a nM
Citation
 Kozikowski, APLiao, YTückmantel, WWang, SPshenichkin, SSurin, AThomsen, CWroblewski, JT Synthesis and biology of the rigidified glutamate analogue, trans-2-carboxyazetidine-3-acetic acid (t-CAA) Bioorg Med Chem Lett 6:2559-2564 (1996)    Article 
Target
Name:
Metabotropic glutamate receptor 6
Synonyms:
GPRC1F GRM6_HUMAN Metabotropic glutamate receptor 6 metabotropic glutamate 6
Type:
Enzyme Catalytic Domain
Mol. Mass.:
95479.26
Organism:
Homo sapiens (Human)
Description:
metabotropic glutamate 6 GRM6 HUMAN::O15303
Residue:
877
  
Inhibitor
Name:
BDBM50288204
Synonyms:
(2S,3S)-3-Carboxymethyl-azetidine-2-carboxylic acid | CHEMBL314690
Type:
Small organic molecule
Emp. Form.:
C6H9NO4
Mol. Mass.:
159.14
SMILES:
OC(=O)C[C@H]1CN[C@@H]1C(O)=O
: