Target
Neutrophil elastase
Ligand
BDBM50282874
Substrate
Meas. Tech.
ChEBML_158078
Ki
0.300000±n/a nM
KON
94000 M-1s-1
Citation
 Hlasta, DJCourt, JJDesai, RCTalomie, TGShen, JDunlap, RPand, CAMura, AJ A comparative SAR and computer modeling study of benzisothiazolone, mechanism-based inhibitors with porcine pancreatic and human leukocyte elastase Bioorg Med Chem Lett 6:2941-2946 (1996)    Article 
Target
Name:
Neutrophil elastase
Synonyms:
Bone marrow serine protease Coagulation factor X ELANE Elastase HLE Leukocyte elastase Medullasin Neutrophil elastase (HNE) PMN elastase Trypsin
Type:
Enzyme
Mol. Mass.:
28532.38
Organism:
Homo sapiens (Human)
Description:
P08246
Residue:
267
  
Inhibitor
Name:
BDBM50282874
Synonyms:
4-Isopropyl-1,1-dioxo-2-(1-phenyl-1H-tetrazol-5-ylsulfanylmethyl)-1,2-dihydro-1lambda*6*-benzo[d]isothiazol-3-one | CHEMBL50974
Type:
Small organic molecule
Emp. Form.:
C18H17N5O3S2
Mol. Mass.:
415.489
SMILES:
CC(C)c1cccc2c1C(=O)N(CSc1nnnn1-c1ccccc1)S2(=O)=O
: