Target
Thymidylate synthase
Ligand
BDBM50288986
Substrate
Meas. Tech.
ChEMBL_209798 (CHEMBL815664)
IC50
6±n/a nM
Citation
 Bavetsias, VJackman, ALKimbell, RBoyle, FTBisset, GM Carboxylic acid bioisosteres of γ-linked dipeptide analogues of the folate-based thymidylate synthase (TS) inhibitor, 2-desamino-2-methyl-N10-propargyl-5,8-dideazafolic acid (ICI 198583) Bioorg Med Chem Lett 6:631-636 (1996)    Article 
Target
Name:
Thymidylate synthase
Synonyms:
TS TYSY_MOUSE | Tyms
Type:
PROTEIN
Mol. Mass.:
34957.15
Organism:
Mus musculus
Description:
ChEMBL_1340097
Residue:
307
  
Inhibitor
Name:
BDBM50288986
Synonyms:
(S)-4-[(S)-1-Carboxy-3-(1H-tetrazol-5-yl)-propylcarbamoyl]-2-{4-[(2-methyl-4-oxo-3,4-dihydro-quinazolin-6-ylmethyl)-prop-2-ynyl-amino]-benzoylamino}-butyric acid | CHEMBL160502
Type:
Small organic molecule
Emp. Form.:
C30H31N9O7
Mol. Mass.:
629.6232
SMILES:
Cc1nc2ccc(CN(CC#C)c3ccc(cc3)C(=O)N[C@@H](CCC(=O)N[C@@H](CCc3nnn[nH]3)C(O)=O)C(O)=O)cc2c(=O)[nH]1
: