Target
Nitric oxide synthase, brain
Ligand
BDBM50289241
Substrate
Meas. Tech.
ChEBML_143507
IC50
100000±n/a nM
Citation
 Cowart, MKowaluk, EAKohlhaas, KLAlexander, KMKerwin, JF Synthesis of phosphorus-containing amino acid analogs as inhibitors of nitric oxide synthase Bioorg Med Chem Lett 6:999-1002 (1996)    Article 
Target
Name:
Nitric oxide synthase, brain
Synonyms:
Bnos NC-NOS NOS type I nNOS Neuronal nitric oxide synthase Nitric Oxide Synthase, brain Nitric oxide synthase, brain (nNOS) Nitric-oxide synthase, brain (nNOS) Nos1 | Peptidyl-cysteine S-nitrosylase NOS1
Type:
Enzyme
Mol. Mass.:
160570.98
Organism:
Rattus norvegicus (rat)
Description:
Recombinant nNOS overexpressed in E. coli was used in enzyme assays.
Residue:
1429
  
Inhibitor
Name:
BDBM50289241
Synonyms:
CHEMBL6305 | [1-Amino-4-(N'-methyl-guanidino)-butyl]-phosphinic acid
Type:
Small organic molecule
Emp. Form.:
C6H15N4O2P
Mol. Mass.:
206.1827
SMILES:
CN=C(N)NCCCC(=N)P(O)O
: