Target
Nitric oxide synthase, brain
Ligand
BDBM50230993
Substrate
Meas. Tech.
ChEBML_143378
Ki
840±n/a nM
Citation
 Shearer, BGLee, SFranzmann, KWWhite, HASanders, DCKiff, RJGarvey, EPFurfine, ES Conformationally restricted arginine analogues as inhibitors of human nitric oxide synthase Bioorg Med Chem Lett 7:1763-1768 (1997)    Article 
Target
Name:
Nitric oxide synthase, brain
Synonyms:
Constitutive NOS NC-NOS NOS type I nNOS NOS1_HUMAN Neuronal nitric oxide synthase Nitric oxide synthase, neuronal (nNOS) bNOS | nNOS
Type:
Homodimer
Mol. Mass.:
160985.98
Organism:
Homo sapiens (Human)
Description:
P29475
Residue:
1434
  
Inhibitor
Name:
BDBM50230993
Synonyms:
(2S)-2-amino-5-[(N-methylcarbamimidoyl)amino]pentanoic acid (R)-2-Amino-5-(N'-methyl-guanidino)-pentanoic acid (S)-2-amino-5-(2-methylguanidino)pentanoic acid 2-Amino-5-(N'-methyl-guanidino)-pentanoic acid L-NMMA N(G)-mono-methyl-L-arginine N-Monomethyl-L-arginine NG-Monomethyl-L-Arginine Ngamma-monomethyl-L-arginine | Targinine
Type:
Small organic molecule
Emp. Form.:
C7H16N4O2
Mol. Mass.:
188.2275
SMILES:
CNC(N)=NCCC[C@H](N)C(O)=O
: