Target
D(2) dopamine receptor
Ligand
BDBM50029257
Substrate
Meas. Tech.
ChEBML_58487
Ki
2.2±n/a nM
Citation
 Reitz, ABMcDonnell, MEBaxter, EWCodd, EEWu, WN The synthesis and evaluation of the major metabolites of mazapertine Bioorg Med Chem Lett 7:1927-1930 (1997)    Article 
Target
Name:
D(2) dopamine receptor
Synonyms:
DOPAMINE D2 DOPAMINE D2 Short Dopamine D2 receptor Drd2
Type:
G Protein-Coupled Receptor (GPCR)
Mol. Mass.:
50931.60
Organism:
Rattus norvegicus (rat)
Description:
P61169
Residue:
444
  
Inhibitor
Name:
BDBM50029257
Synonyms:
(3-((4-(2-isopropoxyphenyl)piperazin-1-yl)methyl)phenyl)(piperidin-1-yl)methanone RWJ-377796 {3-[4-(2-Isopropoxy-phenyl)-piperazin-1-ylmethyl]-phenyl}-piperidin-1-yl-methanone
Type:
Small organic molecule
Emp. Form.:
C26H35N3O2
Mol. Mass.:
421.575
SMILES:
CC(C)Oc1ccccc1N1CCN(Cc2cccc(c2)C(=O)N2CCCCC2)CC1
: