Target
Epidermal growth factor receptor/Receptor tyrosine-protein kinase erbB-2
Ligand
BDBM50214738
Substrate
Meas. Tech.
ChEMBL_48729 (CHEMBL661783)
IC50
>10000±n/a nM
Citation
 Maddry, JAKussner, CTruss, JWNiwas, SWhite, ELKwong, CD Inhibition of the her2 tyrosine kinase and characterization of a hydrophobic site near the nucleotide binding domain Bioorg Med Chem Lett 7:2109-2114 (1997)    Article 
Target
Name:
Epidermal growth factor receptor/Receptor tyrosine-protein kinase erbB-2
Synonyms:
Epidermal growth factor receptor and ErbB2 (HER1 and HER2)
Type:
Mol. Mass.:
Description:
ASSAY_ID of ChEMBL is 48729
Components:
This complex has 2 components.
Component 1
Name:
Epidermal growth factor receptor
Synonyms:
EGF Receptor Substrate EGFR_HUMAN ERBB1 Epidermal Growth Factor Receptor erbB-1 Epidermal growth factor receptor (EGFR) HER1 Proto-oncogene c-ErbB-1 Tyrosine-Protein Kinase ErbB-1
Type:
Receptor Kinase Domain
Mol. Mass.:
134279.59
Organism:
Homo sapiens (Human)
Description:
P00533
Residue:
1210
  
Component 2
Name:
Receptor tyrosine-protein kinase erbB-2
Synonyms:
2.7.10.1 CD_antigen=CD340 ERBB2_HUMAN FASN/HER2 HER2 MLN19 NEU Proto-oncogene Neu Tyrosine kinase-type cell surface receptor HER2 | p185erbB2
Type:
Mol. Mass.:
137894.47
Organism:
Homo sapiens (Human)
Description:
P04626
Residue:
1255
  
Inhibitor
Name:
BDBM50214738
Synonyms:
CHEMBL65594
Type:
Small organic molecule
Emp. Form.:
C19H18N2O5
Mol. Mass.:
354.3566
SMILES:
[O-][N+](=O)\C=C\c1ccc(OC(=O)CCCC(=O)Nc2ccccc2)cc1
: