Target
Adenosine receptor A1
Ligand
BDBM50006702
Substrate
Meas. Tech.
ChEBML_28992
Ki
100±n/a nM
Citation
 Shimada, JKoike, NNonaka, HShiozaki, SYanagawa, KKanda, TKobayashi, HIchimura, MNakamura, JKase, HSuzuki, F Adenosine A2A antagonists with potent anti-cataleptic activity Bioorg Med Chem Lett 7:2349-2352 (1997)    Article 
Target
Name:
Adenosine receptor A1
Synonyms:
AA1R_RAT ADENOSINE A1 high Adenosine A1 receptor (A1) Adenosine receptors A1 | Adora1
Type:
Protein
Mol. Mass.:
36704.13
Organism:
Rattus norvegicus (rat)
Description:
Residue:
326
  
Inhibitor
Name:
BDBM50006702
Synonyms:
7-Methyl-1,3-dipropyl-8-((E)-styryl)-3,7-dihydro-purine-2,6-dione CHEMBL312079
Type:
Small organic molecule
Emp. Form.:
C20H24N4O2
Mol. Mass.:
352.4302
SMILES:
CCCn1c2nc(\C=C\c3ccccc3)n(C)c2c(=O)n(CCC)c1=O
: