Target
Adenosine receptor A1
Ligand
BDBM50290169
Substrate
Meas. Tech.
ChEBML_28992
Ki
560±n/a nM
Citation
 Shimada, JKoike, NNonaka, HShiozaki, SYanagawa, KKanda, TKobayashi, HIchimura, MNakamura, JKase, HSuzuki, F Adenosine A2A antagonists with potent anti-cataleptic activity Bioorg Med Chem Lett 7:2349-2352 (1997)    Article 
Target
Name:
Adenosine receptor A1
Synonyms:
AA1R_RAT ADENOSINE A1 high Adenosine A1 receptor (A1) Adenosine receptors A1 | Adora1
Type:
Protein
Mol. Mass.:
36704.13
Organism:
Rattus norvegicus (rat)
Description:
Residue:
326
  
Inhibitor
Name:
BDBM50290169
Synonyms:
8-[(E)-2-(4-Methoxy-2,3-dimethyl-phenyl)-vinyl]-7-methyl-1,3-dipropyl-3,7-dihydro-purine-2,6-dione | CHEMBL78317
Type:
Small organic molecule
Emp. Form.:
C23H30N4O3
Mol. Mass.:
410.5093
SMILES:
CCCn1c2nc(\C=C\c3ccc(OC)c(C)c3C)n(C)c2c(=O)n(CCC)c1=O
: