Target
Adenosine receptor A2a
Ligand
BDBM50006702
Substrate
Meas. Tech.
ChEMBL_30920 (CHEMBL647730)
Ki
4.9±n/a nM
Citation
 Shimada, JKoike, NNonaka, HShiozaki, SYanagawa, KKanda, TKobayashi, HIchimura, MNakamura, JKase, HSuzuki, F Adenosine A2A antagonists with potent anti-cataleptic activity Bioorg Med Chem Lett 7:2349-2352 (1997)    Article 
Target
Name:
Adenosine receptor A2a
Synonyms:
AA2AR_RAT Adenosine A2 receptor Adenosine Receptors A2a (A2a) Adenosine receptors A2a Rat striatal adenosine A2a receptor
Type:
G Protein-Coupled Receptor (GPCR)
Mol. Mass.:
45015.65
Organism:
Rattus norvegicus (rat)
Description:
Rat A2A receptors expressed in CHO cells.
Residue:
410
  
Inhibitor
Name:
BDBM50006702
Synonyms:
7-Methyl-1,3-dipropyl-8-((E)-styryl)-3,7-dihydro-purine-2,6-dione CHEMBL312079
Type:
Small organic molecule
Emp. Form.:
C20H24N4O2
Mol. Mass.:
352.4302
SMILES:
CCCn1c2nc(\C=C\c3ccccc3)n(C)c2c(=O)n(CCC)c1=O
: