Target
Adenosine receptor A1
Ligand
BDBM50047171
Substrate
Meas. Tech.
ChEBML_28992
Ki
160±n/a nM
Citation
 Shimada, JKoike, NNonaka, HShiozaki, SYanagawa, KKanda, TKobayashi, HIchimura, MNakamura, JKase, HSuzuki, F Adenosine A2A antagonists with potent anti-cataleptic activity Bioorg Med Chem Lett 7:2349-2352 (1997)    Article 
Target
Name:
Adenosine receptor A1
Synonyms:
AA1R_RAT ADENOSINE A1 high Adenosine A1 receptor (A1) Adenosine receptors A1 | Adora1
Type:
Protein
Mol. Mass.:
36704.13
Organism:
Rattus norvegicus (rat)
Description:
Residue:
326
  
Inhibitor
Name:
BDBM50047171
Synonyms:
7-Methyl-1,3-dipropyl-8-[(E)-2-(2,3,4-trimethoxy-phenyl)-vinyl]-3,7-dihydro-purine-2,6-dione CHEMBL283937
Type:
Small organic molecule
Emp. Form.:
C23H30N4O5
Mol. Mass.:
442.5081
SMILES:
CCCn1c2nc(\C=C\c3ccc(OC)c(OC)c3OC)n(C)c2c(=O)n(CCC)c1=O
: