Target
Tyrosine-protein kinase ABL1
Ligand
BDBM50287096
Substrate
Meas. Tech.
ChEBML_226180
IC50
800±n/a nM
Citation
 Zimmermann, JBuchdunger, EMett, HMeyer, TLydon, NB Potent and selective inhibitors of the Abl-kinase: phenylamino-pyrimidine (PAP) derivatives Bioorg Med Chem Lett 7:187-192 (1997)    Article 
Target
Name:
Tyrosine-protein kinase ABL1
Synonyms:
ABL ABL1_HUMAN JTK7 Proto-oncogene tyrosine-protein kinase ABL1 Tyrosine-protein kinase ABL V-abl Abelson murine leukemia viral oncogene homolog 1 p150 | tyrosine-protein kinase ABL1 isoform a
Type:
Enzyme
Mol. Mass.:
122897.30
Organism:
Homo sapiens (Human)
Description:
P00519
Residue:
1130
  
Inhibitor
Name:
BDBM50287096
Synonyms:
2-Methoxy-N-[4-methyl-3-(4-pyridin-3-yl-pyrimidin-2-ylamino)-phenyl]-benzamide | CHEMBL418010
Type:
Small organic molecule
Emp. Form.:
C24H21N5O2
Mol. Mass.:
411.4558
SMILES:
COc1ccccc1C(=O)Nc1ccc(C)c(Nc2nccc(n2)-c2cccnc2)c1
: