Target
Gag-Pol polyprotein [489-587]
Ligand
BDBM50291058
Substrate
Meas. Tech.
ChEBML_157558
Ki
3±n/a nM
Citation
 Schwartz, TMBundy, GLStrohbach, JWThaisrivongs, SJohnson, PDSkulnick, HITomich, PKLynn, JCChong, KTHinshaw, RRRaub, TJPadbury, GEToth, LN Synthesis and pharmacological evaluation of sulfone substituted HIV protease inhibitors Bioorg Med Chem Lett 7:399-402 (1997)    Article 
Target
Name:
Gag-Pol polyprotein [489-587]
Synonyms:
Human immunodeficiency virus type 1 protease Pol polyprotein | gag-pol
Type:
Enzyme Subunit
Mol. Mass.:
10781.16
Organism:
Human immunodeficiency virus type 1
Description:
P04585[489-587]
Residue:
99
  
Inhibitor
Name:
BDBM50291058
Synonyms:
CHEMBL16400 | N-{3-[Cyclopropyl-(4-hydroxy-2-oxo-5,6,7,8,9,10-hexahydro-2H-cycloocta[b]pyran-3-yl)-methyl]-phenyl}-benzenesulfonamide
Type:
Small organic molecule
Emp. Form.:
C27H29NO5S
Mol. Mass.:
479.588
SMILES:
Oc1c2CCCCCCc2oc(=O)c1C(C1CC1)c1cccc(NS(=O)(=O)c2ccccc2)c1
: