Target
5-hydroxytryptamine receptor 1A
Ligand
BDBM50036470
Substrate
Meas. Tech.
ChEMBL_1546 (CHEMBL616368)
Ki
1.9±n/a nM
Citation
 Baxter, EWReitz, AB Hindered rotation congeners of mazapertine: High affinity ligands for the 5-HT1A receptor Bioorg Med Chem Lett 7:763-768 (1997)    Article 
Target
Name:
5-hydroxytryptamine receptor 1A
Synonyms:
5-HT-1A 5-hydroxytryptamine receptor 1A (5-HT-1A) ADRB2RL1 Dopamine D2 receptor and serotonin 1a receptor HTR1A | Serotonin receptor 1A
Type:
Mol. Mass.:
46122.49
Organism:
Homo sapiens (Human)
Description:
Residue:
422
  
Inhibitor
Name:
BDBM50036470
Synonyms:
(3aR,9bS)-3-Propyl-2,3,3a,4,5,9b-hexahydro-1H-benzo[e]indole-9-carboxylic acid amide | CHEMBL349003
Type:
Small organic molecule
Emp. Form.:
C16H22N2O
Mol. Mass.:
258.3587
SMILES:
CCCN1CC[C@@H]2[C@H]1CCc1cccc(C(N)=O)c21
: