Target
D(3) dopamine receptor
Ligand
BDBM50029257
Substrate
Meas. Tech.
ChEBML_62923
Ki
1.8±n/a nM
Citation
 Baxter, EWReitz, AB Hindered rotation congeners of mazapertine: High affinity ligands for the 5-HT1A receptor Bioorg Med Chem Lett 7:763-768 (1997)    Article 
Target
Name:
D(3) dopamine receptor
Synonyms:
DOPAMINE D3 DRD3_HUMAN Dopamine D3 receptor (D3) Dopamine receptor Dopamine receptor D3
Type:
Mol. Mass.:
44243.43
Organism:
Homo sapiens (Human)
Description:
Residue:
400
  
Inhibitor
Name:
BDBM50029257
Synonyms:
(3-((4-(2-isopropoxyphenyl)piperazin-1-yl)methyl)phenyl)(piperidin-1-yl)methanone RWJ-377796 {3-[4-(2-Isopropoxy-phenyl)-piperazin-1-ylmethyl]-phenyl}-piperidin-1-yl-methanone
Type:
Small organic molecule
Emp. Form.:
C26H35N3O2
Mol. Mass.:
421.575
SMILES:
CC(C)Oc1ccccc1N1CCN(Cc2cccc(c2)C(=O)N2CCCCC2)CC1
: