Target
5-hydroxytryptamine receptor 1A
Ligand
BDBM50291354
Substrate
Meas. Tech.
ChEMBL_1546 (CHEMBL616368)
Ki
0.890000±n/a nM
Citation
 Baxter, EWReitz, AB Hindered rotation congeners of mazapertine: High affinity ligands for the 5-HT1A receptor Bioorg Med Chem Lett 7:763-768 (1997)    Article 
Target
Name:
5-hydroxytryptamine receptor 1A
Synonyms:
5-HT-1A 5-hydroxytryptamine receptor 1A (5-HT-1A) ADRB2RL1 Dopamine D2 receptor and serotonin 1a receptor HTR1A | Serotonin receptor 1A
Type:
Mol. Mass.:
46122.49
Organism:
Homo sapiens (Human)
Description:
Residue:
422
  
Inhibitor
Name:
BDBM50291354
Synonyms:
2-[3-((S)-5-Methoxy-1,3,4,4a,9,9a-hexahydro-indeno[2,1-c]pyridin-2-yl)-propyl]-1,1-dioxo-1,2-dihydro-1lambda*6*-benzo[d]isothiazol-3-one | CHEMBL165718
Type:
Small organic molecule
Emp. Form.:
C23H26N2O4S
Mol. Mass.:
426.529
SMILES:
COc1cccc2C[C@@H]3CN(CCCN4C(=O)c5ccccc5S4(=O)=O)CCC3c12
: