Target
Metabotropic glutamate receptor 6
Ligand
BDBM50291680
Substrate
Meas. Tech.
ChEBML_104467
IC50
480000±n/a nM
Citation
 Ma, DTian, HSun, HKozikowshi, APPshenichkin, SWroblewski, JT Synthesis and biological activity of cyclic analogues of MPPG and MCPG as metabotropic glutamate receptor antagonists Bioorg Med Chem Lett 7:1195-1198 (1997)    Article 
Target
Name:
Metabotropic glutamate receptor 6
Synonyms:
GRM6_RAT Grm6 Metabotropic glutamate receptor 6 (mGlu6) mGlu6 | metabotropic glutamate 6
Type:
Enzyme
Mol. Mass.:
95095.82
Organism:
Rattus norvegicus (Rat)
Description:
P35349
Residue:
871
  
Inhibitor
Name:
BDBM50291680
Synonyms:
(S)-2-(4-Phosphono-phenylamino)-propionic acid | CHEMBL18439
Type:
Small organic molecule
Emp. Form.:
C9H12NO5P
Mol. Mass.:
245.169
SMILES:
C[C@H](Nc1ccc(cc1)P(O)(O)=O)C(O)=O
: