Target
5-hydroxytryptamine receptor 1A
Ligand
BDBM50292383
Substrate
Meas. Tech.
ChEMBL_549544 (CHEMBL1013316)
IC50
>10000±n/a nM
Citation
 Lewin, GSchaeffer, CDacquet, C Perhydrogenation of tabersonine, ans Aspidiosperma indole alkaloid. J Nat Prod 60:419-20 (1997)  
Target
Name:
5-hydroxytryptamine receptor 1A
Synonyms:
5-HT-1A 5-hydroxytryptamine receptor 1A (5-HT-1A) ADRB2RL1 Dopamine D2 receptor and serotonin 1a receptor HTR1A | Serotonin receptor 1A
Type:
Mol. Mass.:
46122.49
Organism:
Homo sapiens (Human)
Description:
Residue:
422
  
Inhibitor
Name:
BDBM50292383
Synonyms:
(-)-Tabersonine hydrochloride | CHEMBL509387
Type:
Small organic molecule
Emp. Form.:
C21H26N2O2
Mol. Mass.:
338.4433
SMILES:
CC[C@@]12CCCN3CC[C@@]4([C@H]13)C(=Nc1ccccc41)C(C2)C(=O)OC
: