Target
5-hydroxytryptamine receptor 2A
Ligand
BDBM50292384
Substrate
Meas. Tech.
ChEMBL_549545 (CHEMBL1013317)
IC50
>10000±n/a nM
Citation
 Lewin, GSchaeffer, CDacquet, C Perhydrogenation of tabersonine, ans Aspidiosperma indole alkaloid. J Nat Prod 60:419-20 (1997)  
Target
Name:
5-hydroxytryptamine receptor 2A
Synonyms:
5-HT-2 5-HT2A 5-hydroxytryptamine receptor 2A (5HT-2A) 5HT2A_HUMAN HTR2A | Serotonin receptor 2A
Type:
undefined
Mol. Mass.:
52607.65
Organism:
Homo sapiens (Human)
Description:
P28223
Residue:
471
  
Inhibitor
Name:
BDBM50292384
Synonyms:
(3aS,3a1S,5S,5aS,6aR,10aR,10a1S)-3a-ethylhexadecahydro-1H-indolizino[8,1-cd]carbazole-5-carboxylate sodium salt | CHEMBL453023
Type:
Small organic molecule
Emp. Form.:
C20H31N2O2
Mol. Mass.:
331.4729
SMILES:
CC[C@]12CCCN3CC[C@@]4([C@H]5CCCC[C@H]5N[C@H]4[C@H](C1)C([O-])=O)[C@H]23
: