Target
5-hydroxytryptamine receptor 3A
Ligand
BDBM50292383
Substrate
Meas. Tech.
ChEMBL_549546 (CHEMBL1013318)
IC50
>1E5±n/a nM
Citation
 Lewin, GSchaeffer, CDacquet, C Perhydrogenation of tabersonine, ans Aspidiosperma indole alkaloid. J Nat Prod 60:419-20 (1997)  
Target
Name:
5-hydroxytryptamine receptor 3A
Synonyms:
5-HT-3 5-HT3A 5-hydroxytryptamine receptor 3 (5-HT3) 5-hydroxytryptamine receptor 3A (5HT3A) 5HT3R HTR3A Serotonin 3 receptor (5HT3) Serotonin-gated ion channel receptor | Serotonin-gated ion channel receptor 3
Type:
Protein
Mol. Mass.:
55283.27
Organism:
Homo sapiens (Human)
Description:
P46098
Residue:
478
  
Inhibitor
Name:
BDBM50292383
Synonyms:
(-)-Tabersonine hydrochloride | CHEMBL509387
Type:
Small organic molecule
Emp. Form.:
C21H26N2O2
Mol. Mass.:
338.4433
SMILES:
CC[C@@]12CCCN3CC[C@@]4([C@H]13)C(=Nc1ccccc41)C(C2)C(=O)OC
: