Target
Tyrosine-protein kinase Lck
Ligand
BDBM50025610
Substrate
Meas. Tech.
ChEMBL_506203 (CHEMBL941407)
IC50
1270000±n/a nM
Citation
 Chang, CJGeahlen, RL Protein-Tyrosine Kinase Inhibition: Mechanism-Based Discovery of Antitumor Agents J Nat Prod 55:1529-1560 (1992)  
Target
Name:
Tyrosine-protein kinase Lck
Synonyms:
2.7.10.2 LCK_HUMAN Leukocyte C-terminal Src kinase Lymphocyte-specific protein tyrosine kinase Protein YT16 Proto-oncogene tyrosine-protein kinase LCK T cell-specific protein-tyrosine kinase
Type:
Mol. Mass.:
57987.83
Organism:
Homo sapiens (Human)
Description:
P06239
Residue:
509
  
Inhibitor
Name:
BDBM50025610
Synonyms:
CHEMBL489764
Type:
Small organic molecule
Emp. Form.:
C17H14O6
Mol. Mass.:
314.2895
SMILES:
COc1cc(cc(OC)c1O)-c1cc(=O)c2ccc(O)cc2o1
: