Target
D(2) dopamine receptor
Ligand
BDBM50292553
Substrate
Meas. Tech.
ChEMBL_483726 (CHEMBL997481)
IC50
66400±n/a nM
Citation
 Cortes, DFigadere, BSaez, JProtais, P Displacement Activity of Bisbenzylisoquinoline Alkaloids at Striatal 3H-SCH 23390 and 3H-Raclopride Binding Sites J Nat Prod 55:1281-1286 (1992)  
Target
Name:
D(2) dopamine receptor
Synonyms:
DOPAMINE D2 DOPAMINE D2 Short Dopamine D2 receptor Drd2
Type:
G Protein-Coupled Receptor (GPCR)
Mol. Mass.:
50931.60
Organism:
Rattus norvegicus (rat)
Description:
P61169
Residue:
444
  
Inhibitor
Name:
BDBM50292553
Synonyms:
(R,S)-homoaromaline hydrochloride | CHEMBL443953
Type:
Small organic molecule
Emp. Form.:
C37H40N2O6
Mol. Mass.:
608.7233
SMILES:
COc1ccc2C[C@@H]3N(C)CCc4cc(OC)c(Oc5c(O)c(OC)cc6CCN(C)[C@H](Cc7ccc(Oc1c2)cc7)c56)cc34
: