Target
Potassium voltage-gated channel subfamily H member 2
Ligand
BDBM79214
Substrate
Meas. Tech.
ChEMBL_494878 (CHEMBL949428)
IC50
40±n/a nM
Citation
 O'Neill, PMPark, BKShone, AEMaggs, JLRoberts, PStocks, PABiagini, GABray, PGGibbons, PBerry, NWinstanley, PAMukhtar, ABonar-Law, RHindley, SBambal, RBDavis, CBBates, MHart, TKGresham, SLLawrence, RMBrigandi, RAGomez-delas-Heras, FMGargallo, DVWard, SA Candidate selection and preclinical evaluation of N-tert-butyl isoquine (GSK369796), an affordable and effective 4-aminoquinoline antimalarial for the 21st century. J Med Chem 52:1408-15 (2010)  
Target
Name:
Potassium voltage-gated channel subfamily H member 2
Synonyms:
1,3-beta-glucan synthase component GLS2 ERG Eag-related protein 1 Ether-a-go-go-related gene (HERG) Ether-a-go-go-related gene potassium channel 1 Ether-a-go-go-related gene potassium channel 1 (hERG1) Ether-a-go-go-related protein 1 H-ERG KCNH2 Potassium voltage-gated channel subfamily H member 2 (hERG) Voltage-gated potassium channel subunit Kv11.1 hERG Potassium Channel 1 | putative potassium channel subunit
Type:
Multi-pass membrane protein
Mol. Mass.:
126672.65
Organism:
Homo sapiens (Human)
Description:
Q12809
Residue:
1159
  
Inhibitor
Name:
BDBM79214
Synonyms:
1-[1,3-bis(chloranyl)-6-(trifluoromethyl)phenanthren-9-yl]-3-(dibutylamino)propan-1-ol;hydrochloride 3-(dibutylamino)-1-[1,3-dichloro-6-(trifluoromethyl)-9-phenanthryl]propan-1-ol;hydrochloride HALOFANTRINE MLS002154111 cid_37392
Type:
Small organic molecule
Emp. Form.:
C26H30Cl2F3NO
Mol. Mass.:
500.424
SMILES:
CCCCN(CCCC)CCC(O)c1cc2c(Cl)cc(Cl)cc2c2cc(ccc12)C(F)(F)F
: