Target
Excitatory amino acid transporter 1
Ligand
BDBM50292990
Substrate
Meas. Tech.
ChEMBL_496042 (CHEMBL998472)
IC50
9200±n/a nM
Citation
 Jensen, AAErichsen, MNNielsen, CWStensbøl, TBKehler, JBunch, L Discovery of the first selective inhibitor of excitatory amino acid transporter subtype 1. J Med Chem 52:912-5 (2009)  
Target
Name:
Excitatory amino acid transporter 1
Synonyms:
EAA1_HUMAN Excitatory Amino Acid EAAT1 GLAST1 | SLC1A3
Type:
Enzyme Catalytic Domain
Mol. Mass.:
59577.19
Organism:
Homo sapiens (Human)
Description:
Excitatory Amino Acid EAAT1 0 HUMAN::P43003
Residue:
542
  
Inhibitor
Name:
BDBM50292990
Synonyms:
2-amino-4-methyl-5-oxo-7-phenyl-5,6,7,8-tetrahydro-4H-chromene-3-carbonitrile | CHEMBL474063
Type:
Small organic molecule
Emp. Form.:
C17H16N2O2
Mol. Mass.:
280.3211
SMILES:
CC1C(C#N)C(=N)OC2=C1C(=O)CC(C2)c1ccccc1
: