Target
Cytochrome P450 2D6
Ligand
BDBM50293131
Substrate
Meas. Tech.
ChEMBL_514930 (CHEMBL972656)
IC50
>30000±n/a nM
Citation
 Li, HTatlock, JLinton, AGonzalez, JJewell, TPatel, LLudlum, SDrowns, MRahavendran, SVSkor, HHunter, RShi, STHerlihy, KJParge, HHickey, MYu, XChau, FNonomiya, JLewis, C Discovery of (R)-6-cyclopentyl-6-(2-(2,6-diethylpyridin-4-yl)ethyl)-3-((5,7-dimethyl-[1,2,4]triazolo[1,5-a]pyrimidin-2-yl)methyl)-4-hydroxy-5,6-dihydropyran-2-one (PF-00868554) as a potent and orally available hepatitis C virus polymerase inhibitor. J Med Chem 52:1255-8 (2010)  
Target
Name:
Cytochrome P450 2D6
Synonyms:
CP2D6_HUMAN CYP2DL1 Cytochrome P450 2D6 (CYP2D6) P450-DB1
Type:
Protein
Mol. Mass.:
55774.82
Organism:
Homo sapiens (Human)
Description:
P10635
Residue:
497
  
Inhibitor
Name:
BDBM50293131
Synonyms:
(6R)-6-cyclopentyl-6-[2-(2,6-diethylpyridin-4-yl)ethyl]-3-[(5,7-dimethyl[1,2,4]triazolo[1,5-a]pyrimidin-2-yl)methyl]-4-hydroxy-5,6-dihydro-2H-pyran-2-one CHEMBL490672 | PF-00868554
Type:
Small organic molecule
Emp. Form.:
C29H37N5O3
Mol. Mass.:
503.6358
SMILES:
CCc1cc(CC[C@@]2(CC(=O)C(Cc3nc4nc(C)cc(C)n4n3)C(=O)O2)C2CCCC2)cc(CC)n1
: