Target
Cyclin-dependent kinase 4
Ligand
BDBM50293140
Substrate
Meas. Tech.
ChEMBL_496923 (CHEMBL1002018)
IC50
200±n/a nM
Citation
 Stevens, KLReno, MJAlberti, JBPrice, DJKane-Carson, LSKnick, VBShewchuk, LMHassell, AMVeal, JMDavis, STGriffin, RJPeel, MR Synthesis and evaluation of pyrazolo[1,5-b]pyridazines as selective cyclin dependent kinase inhibitors. Bioorg Med Chem Lett 18:5758-62 (2009)  
Target
Name:
Cyclin-dependent kinase 4
Synonyms:
CDK4 Cell division protein kinase 4 PSK-J3
Type:
Enzyme Subunit
Mol. Mass.:
33731.96
Organism:
Homo sapiens (Human)
Description:
P11802
Residue:
303
  
Inhibitor
Name:
BDBM50293140
Synonyms:
CHEMBL496779 | N-cyclopropyl-4-(6-vinylpyrazolo[1,5-b]pyridazin-3-yl)pyrimidin-2-amine
Type:
Small organic molecule
Emp. Form.:
C15H14N6
Mol. Mass.:
278.3119
SMILES:
C=Cc1ccc2c(cnn2n1)-c1ccnc(NC2CC2)n1
: