Target
Cyclin-dependent kinase 4
Ligand
BDBM50293150
Substrate
Meas. Tech.
ChEMBL_496923 (CHEMBL1002018)
IC50
6±n/a nM
Citation
 Stevens, KLReno, MJAlberti, JBPrice, DJKane-Carson, LSKnick, VBShewchuk, LMHassell, AMVeal, JMDavis, STGriffin, RJPeel, MR Synthesis and evaluation of pyrazolo[1,5-b]pyridazines as selective cyclin dependent kinase inhibitors. Bioorg Med Chem Lett 18:5758-62 (2009)  
Target
Name:
Cyclin-dependent kinase 4
Synonyms:
CDK4 Cell division protein kinase 4 PSK-J3
Type:
Enzyme Subunit
Mol. Mass.:
33731.96
Organism:
Homo sapiens (Human)
Description:
P11802
Residue:
303
  
Inhibitor
Name:
BDBM50293150
Synonyms:
CHEMBL468963 GSK screening, 38 TCMDC-138687
Type:
Small organic molecule
Emp. Form.:
C22H21F3N8
Mol. Mass.:
454.4509
SMILES:
CN1CCN(CC1)c1ccc(Nc2nccc(n2)-c2cnn3ncccc23)cc1C(F)(F)F
: