Target
Vascular endothelial growth factor receptor 2
Ligand
BDBM50293167
Substrate
Meas. Tech.
ChEMBL_496924 (CHEMBL1002019)
IC50
63±n/a nM
Citation
 Stevens, KLReno, MJAlberti, JBPrice, DJKane-Carson, LSKnick, VBShewchuk, LMHassell, AMVeal, JMDavis, STGriffin, RJPeel, MR Synthesis and evaluation of pyrazolo[1,5-b]pyridazines as selective cyclin dependent kinase inhibitors. Bioorg Med Chem Lett 18:5758-62 (2009)  
Target
Name:
Vascular endothelial growth factor receptor 2
Synonyms:
CD_antigen=CD309 Fetal liver kinase 1 (FLK-1) KDR Protein-tyrosine kinase receptor Flk-1 VEGFR-2 VEGFR2 Vascular Endothelial Growth Factor Receptor Kinase 2 Vascular endothelial growth factor receptor 2 (KDR) Vascular endothelial growth factor receptor 2 (VEGFR2) Vascular endothelial growth factor receptor-2 (VEGFR-2)
Type:
Receptor Tyrosine Kinase
Mol. Mass.:
151510.97
Organism:
Homo sapiens (Human)
Description:
P35968
Residue:
1356
  
Inhibitor
Name:
BDBM50293167
Synonyms:
CHEMBL524086 | N-(4-(4-methylpiperazin-1-yl)phenyl)-4-(2-methylpyrazolo[1,5-b]pyridazin-3-yl)pyrimidin-2-amine
Type:
Small organic molecule
Emp. Form.:
C22H24N8
Mol. Mass.:
400.4796
SMILES:
CN1CCN(CC1)c1ccc(Nc2nccc(n2)-c2c(C)nn3ncccc23)cc1
: