Target
Vascular endothelial growth factor receptor 2
Ligand
BDBM50293168
Substrate
Meas. Tech.
ChEMBL_496924 (CHEMBL1002019)
IC50
63±n/a nM
Citation
 Stevens, KLReno, MJAlberti, JBPrice, DJKane-Carson, LSKnick, VBShewchuk, LMHassell, AMVeal, JMDavis, STGriffin, RJPeel, MR Synthesis and evaluation of pyrazolo[1,5-b]pyridazines as selective cyclin dependent kinase inhibitors. Bioorg Med Chem Lett 18:5758-62 (2009)  
Target
Name:
Vascular endothelial growth factor receptor 2
Synonyms:
CD_antigen=CD309 Fetal liver kinase 1 (FLK-1) KDR Protein-tyrosine kinase receptor Flk-1 VEGFR-2 VEGFR2 Vascular Endothelial Growth Factor Receptor Kinase 2 Vascular endothelial growth factor receptor 2 (KDR) Vascular endothelial growth factor receptor 2 (VEGFR2) Vascular endothelial growth factor receptor-2 (VEGFR-2)
Type:
Receptor Tyrosine Kinase
Mol. Mass.:
151510.97
Organism:
Homo sapiens (Human)
Description:
P35968
Residue:
1356
  
Inhibitor
Name:
BDBM50293168
Synonyms:
4-(2-ethylpyrazolo[1,5-b]pyridazin-3-yl)-N-(4-(4-methylpiperazin-1-yl)phenyl)pyrimidin-2-amine | CHEMBL496360
Type:
Small organic molecule
Emp. Form.:
C23H26N8
Mol. Mass.:
414.5061
SMILES:
CCc1nn2ncccc2c1-c1ccnc(Nc2ccc(cc2)N2CCN(C)CC2)n1
: