Target
Glycogen synthase kinase-3 beta
Ligand
BDBM50293151
Substrate
Meas. Tech.
ChEMBL_496925 (CHEMBL1002020)
IC50
79±n/a nM
Citation
 Stevens, KLReno, MJAlberti, JBPrice, DJKane-Carson, LSKnick, VBShewchuk, LMHassell, AMVeal, JMDavis, STGriffin, RJPeel, MR Synthesis and evaluation of pyrazolo[1,5-b]pyridazines as selective cyclin dependent kinase inhibitors. Bioorg Med Chem Lett 18:5758-62 (2009)  
Target
Name:
Glycogen synthase kinase-3 beta
Synonyms:
GSK-3 beta GSK3B Glycogen synthase kinase 3 beta (GSK3B) Glycogen synthase kinase-3 beta (GSK-3B) Glycogen synthase kinase-3 beta (GSK3B) Glycogen synthase kinase-3beta (GSK3B) | Serine/threonine-protein kinase GSK3B
Type:
Enzyme
Mol. Mass.:
46756.38
Organism:
Homo sapiens (Human)
Description:
P49841
Residue:
420
  
Inhibitor
Name:
BDBM50293151
Synonyms:
CHEMBL513354 | N-(3-((diethylamino)methyl)phenyl)-4-(pyrazolo[1,5-b]pyridazin-3-yl)pyrimidin-2-amine
Type:
Small organic molecule
Emp. Form.:
C21H23N7
Mol. Mass.:
373.4542
SMILES:
CCN(CC)Cc1cccc(Nc2nccc(n2)-c2cnn3ncccc23)c1
: